Target
Transitional endoplasmic reticulum ATPase
Ligand
BDBM50424855
Substrate
Meas. Tech.
ChEMBL_934533 (CHEMBL2317274)
IC50
720±n/a nM
Citation
 Angiolini, MAsa, DAvanzi, NBadari, ABertrand, JCasale, ECirla, ACozzi, LCauteruccio, SDonati, DGalvani, AIsacchi, AJackson, PKLiu, YMagnaghi, PMagnuson, SMalgesini, BNuvoloni, SOrrenius, CPolucci, PRiceputi, LTrucchi, BO Brien, TRizzi, SSirtori, FRD Alessio, R Alkylsulfanyl-1,2,4-triazoles, a new class of allosteric valosine containing protein inhibitors. Synthesis and structure-activity relationships. J Med Chem 56:437-50 (2013)  
Target
Name:
Transitional endoplasmic reticulum ATPase
Synonyms:
TERA_HUMAN VCP Valosin-containing protein
Type:
Enzyme
Mol. Mass.:
89300.63
Organism:
Homo sapiens (Human)
Description:
P55072
Residue:
806
  
Inhibitor
Name:
BDBM50424855
Synonyms:
CHEMBL2315462
Type:
Small organic molecule
Emp. Form.:
C20H21N3OS
Mol. Mass.:
351.465
SMILES:
C(Oc1ccccc1)c1nnc(SC2CCCC2)n1-c1ccccc1
: