Target
D-beta-D-heptose 7-phosphate kinase
Ligand
BDBM50425038
Substrate
Meas. Tech.
ChEMBL_936590 (CHEMBL2318753)
IC50
230±n/a nM
Citation
 Lee, TWVerhey, TBAntiperovitch, PAAtamanyuk, DDesroy, NOliveira, CDenis, AGerusz, VDrocourt, ELoutet, SAHamad, MAStanetty, CAndres, SNSugiman-Marangos, SKosma, PValvano, MAMoreau, FJunop, MS Structural-functional studies of Burkholderia cenocepacia D-glycero-ß-D-manno-heptose 7-phosphate kinase (HldA) and characterization of inhibitors with antibiotic adjuvant and antivirulence properties. J Med Chem 56:1405-17 (2013)  
Target
Name:
D-beta-D-heptose 7-phosphate kinase
Synonyms:
hldA
Type:
PROTEIN
Mol. Mass.:
33999.14
Organism:
Burkholderia cepacia (strain J2315 / LMG 16656) (Burkholderiacenocepacia (strain J2315))
Description:
ChEMBL_936590
Residue:
316
  
Inhibitor
Name:
BDBM50425038
Synonyms:
CHEMBL2312560
Type:
Small organic molecule
Emp. Form.:
C19H13Cl2N5O3S
Mol. Mass.:
462.309
SMILES:
OC(=O)COc1ccc2sc(CNc3nncc(n3)-c3c(Cl)cccc3Cl)nc2c1
: