Target
Pancreatic alpha-amylase
Ligand
BDBM50425184
Substrate
Meas. Tech.
ChEMBL_936874 (CHEMBL2320756)
IC50
18880±n/a nM
Citation
 Patil, VSNandre, KPGhosh, SRao, VJChopade, BASridhar, BBhosale, SVBhosale, SV Synthesis, crystal structure and antidiabetic activity of substituted (E)-3-(Benzo [d]thiazol-2-ylamino) phenylprop-2-en-1-one. Eur J Med Chem 59:304-9 (2013)  
Target
Name:
Pancreatic alpha-amylase
Synonyms:
1,4-alpha-D-glucan glucanohydrolase AMYP_PIG Pancreatic α-amylase
Type:
Protein
Mol. Mass.:
57088.07
Organism:
Sus scrofa (Pig)
Description:
P00690
Residue:
511
  
Inhibitor
Name:
BDBM50425184
Synonyms:
CHEMBL2313582
Type:
Small organic molecule
Emp. Form.:
C20H20N2O2S2
Mol. Mass.:
384.515
SMILES:
CCOc1ccc2nc(N=C(CC(=O)c3ccc(C)cc3)SC)sc2c1
: