Target
Pancreatic alpha-amylase
Ligand
BDBM50425174
Substrate
Meas. Tech.
ChEMBL_936874 (CHEMBL2320756)
IC50
20590±n/a nM
Citation
 Patil, VSNandre, KPGhosh, SRao, VJChopade, BASridhar, BBhosale, SVBhosale, SV Synthesis, crystal structure and antidiabetic activity of substituted (E)-3-(Benzo [d]thiazol-2-ylamino) phenylprop-2-en-1-one. Eur J Med Chem 59:304-9 (2013)  
Target
Name:
Pancreatic alpha-amylase
Synonyms:
1,4-alpha-D-glucan glucanohydrolase AMYP_PIG Pancreatic α-amylase
Type:
Protein
Mol. Mass.:
57088.07
Organism:
Sus scrofa (Pig)
Description:
P00690
Residue:
511
  
Inhibitor
Name:
BDBM50425174
Synonyms:
CHEMBL2313592
Type:
Small organic molecule
Emp. Form.:
C18H16N2OS2
Mol. Mass.:
340.462
SMILES:
CSC(CC(=O)c1ccc(C)cc1)=Nc1nc2ccccc2s1
: