Target
Histone-lysine N-methyltransferase EHMT2
Ligand
BDBM50425308
Substrate
Meas. Tech.
ChEMBL_933812 (CHEMBL2321366)
IC50
3300±n/a nM
Citation
 Fujishiro, SDodo, KIwasa, ETeng, YSohtome, YHamashima, YIto, AYoshida, MSodeoka, M Epidithiodiketopiperazine as a pharmacophore for protein lysine methyltransferase G9a inhibitors: reducing cytotoxicity by structural simplification. Bioorg Med Chem Lett 23:733-6 (2013)  
Target
Name:
Histone-lysine N-methyltransferase EHMT2
Synonyms:
BAT8 EHMT2 G9A Histone-lysine N-methyltransferase EHMT1/EHMT2 KMT1C Protein G9a (G9a)
Type:
Enzyme
Mol. Mass.:
132339.87
Organism:
Homo sapiens (Human)
Description:
Q96KQ7
Residue:
1210
  
Inhibitor
Name:
BDBM50425308
Synonyms:
CHEMBL2311579
Type:
Small organic molecule
Emp. Form.:
C21H29N3O3S2Si
Mol. Mass.:
463.689
SMILES:
CN1C(=O)[C@@]23C[C@H]4[C@H](Nc5ccccc45)N2C(=O)[C@@]1(CO[Si](C)(C)C(C)(C)C)SS3
: