Target
Neuropeptides B/W receptor type 1
Ligand
BDBM50425580
Substrate
Meas. Tech.
ChEMBL_936637 (CHEMBL2319036)
IC50
370±n/a nM
Citation
 Guerrero, MUrbano, MSchaeffer, MTBrown, SRosen, HRoberts, E SAR analysis of novel non-peptidic NPBWR1 (GPR7) antagonists. Bioorg Med Chem Lett 23:614-9 (2013)  
Target
Name:
Neuropeptides B/W receptor type 1
Synonyms:
GPR7 NPBWR1 | neuropeptides B/W receptor 1
Type:
Enzyme Catalytic Domain
Mol. Mass.:
36111.82
Organism:
Homo sapiens (Human)
Description:
gi_119607128
Residue:
328
  
Inhibitor
Name:
BDBM50425580
Synonyms:
CHEMBL2314621
Type:
Small organic molecule
Emp. Form.:
C24H15Cl2N3O4
Mol. Mass.:
480.3
SMILES:
COc1ccc(Oc2c(Cl)cnn(C3=Nc4cc(Cl)ccc4Oc4ccccc34)c2=O)cc1
: