Target
Cytochrome P450 1A2
Ligand
BDBM50425648
Substrate
Meas. Tech.
ChEMBL_937181 (CHEMBL2318287)
IC50
>100000±n/a nM
Citation
 Saupe, SMLeubner, SBetz, MKlebe, GSteinmetzer, T Development of new cyclic plasmin inhibitors with excellent potency and selectivity. J Med Chem 56:820-31 (2013)  
Target
Name:
Cytochrome P450 1A2
Synonyms:
CP1A2_HUMAN CYPIA2 Cytochrome P(3)450 Cytochrome P450 1A2 (CYP1A2) Cytochrome P450-P3
Type:
Enzyme
Mol. Mass.:
58423.38
Organism:
Homo sapiens (Human)
Description:
P05177
Residue:
516
  
Inhibitor
Name:
BDBM50425648
Synonyms:
CHEMBL2315243
Type:
Small organic molecule
Emp. Form.:
C43H51N9O6S
Mol. Mass.:
821.987
SMILES:
NC(=N)c1ccc(CNC(=O)[C@@H]2Cc3ccc(NC(=O)CCN4CCN(CC4)CCC(=O)Nc4ccc(C[C@@H](NS(=O)(=O)Cc5ccccc5)C(=O)N2)cc4)cc3)cc1
: