Target
Plasminogen
Ligand
BDBM50425650
Substrate
Meas. Tech.
ChEMBL_937467 (CHEMBL2320215)
Ki
1.7±n/a nM
Citation
 Saupe, SMLeubner, SBetz, MKlebe, GSteinmetzer, T Development of new cyclic plasmin inhibitors with excellent potency and selectivity. J Med Chem 56:820-31 (2013)  
Target
Name:
Plasminogen
Synonyms:
Activation peptide PLG Plasmin Plasmin heavy chain A, short form | Plasmin light chain B
Type:
Enzyme
Mol. Mass.:
90579.18
Organism:
Homo sapiens (Human)
Description:
Residue:
810
  
Inhibitor
Name:
BDBM50425650
Synonyms:
CHEMBL2315238
Type:
Small organic molecule
Emp. Form.:
C44H53N9O6S
Mol. Mass.:
836.013
SMILES:
C[C@H]1CN2CC(=O)Nc3ccc(C[C@H](NC(=O)[C@@H](Cc4ccc(CNC(=O)CN1C[C@@H]2C)cc4)NS(=O)(=O)Cc1ccccc1)C(=O)NCc1ccc(cc1)C(N)=N)cc3
: