Target
Plasminogen
Ligand
BDBM50425656
Substrate
Meas. Tech.
ChEMBL_937467 (CHEMBL2320215)
Ki
0.570000±n/a nM
Citation
 Saupe, SMLeubner, SBetz, MKlebe, GSteinmetzer, T Development of new cyclic plasmin inhibitors with excellent potency and selectivity. J Med Chem 56:820-31 (2013)  
Target
Name:
Plasminogen
Synonyms:
Activation peptide PLG Plasmin Plasmin heavy chain A, short form | Plasmin light chain B
Type:
Enzyme
Mol. Mass.:
90579.18
Organism:
Homo sapiens (Human)
Description:
Residue:
810
  
Inhibitor
Name:
BDBM50425656
Synonyms:
CHEMBL2315246
Type:
Small organic molecule
Emp. Form.:
C42H49N9O6S
Mol. Mass.:
807.96
SMILES:
NC(=N)c1ccc(CNC(=O)[C@@H]2Cc3ccc(NC(=O)CN4CCCN(CC4)CC(=O)Nc4ccc(C[C@@H](NS(=O)(=O)Cc5ccccc5)C(=O)N2)cc4)cc3)cc1
: