Target
Tyrosine-protein phosphatase non-receptor type 7
Ligand
BDBM50425806
Substrate
Meas. Tech.
ChEMBL_937596 (CHEMBL2321065)
IC50
1900±n/a nM
Citation
 He, YXu, JYu, ZHGunawan, AMWu, LWang, LZhang, ZY Discovery and evaluation of novel inhibitors of mycobacterium protein tyrosine phosphatase B from the 6-Hydroxy-benzofuran-5-carboxylic acid scaffold. J Med Chem 56:832-42 (2013)  
Target
Name:
Tyrosine-protein phosphatase non-receptor type 7
Synonyms:
He-PTP Hematopoietic protein-tyrosine phosphatase (HEPTP) PTPN7 Tyrosine-protein phosphatase non-receptor type 7 | Tyrosine-protein phosphatase non-receptor type 7 (HEPTP)
Type:
Protein
Mol. Mass.:
40530.79
Organism:
Homo sapiens (Human)
Description:
P35236
Residue:
360
  
Inhibitor
Name:
BDBM50425806
Synonyms:
CHEMBL2316907
Type:
Small organic molecule
Emp. Form.:
C24H13F3O5
Mol. Mass.:
438.3522
SMILES:
OC(=O)c1cc2c(C#Cc3ccc(OC(F)(F)F)cc3)c(oc2cc1O)-c1ccccc1
: