Target
Tyrosine-protein phosphatase non-receptor type 9
Ligand
BDBM50425819
Substrate
Meas. Tech.
ChEMBL_937600 (CHEMBL2321069)
IC50
9000±n/a nM
Citation
 He, YXu, JYu, ZHGunawan, AMWu, LWang, LZhang, ZY Discovery and evaluation of novel inhibitors of mycobacterium protein tyrosine phosphatase B from the 6-Hydroxy-benzofuran-5-carboxylic acid scaffold. J Med Chem 56:832-42 (2013)  
Target
Name:
Tyrosine-protein phosphatase non-receptor type 9
Synonyms:
3.1.3.48 PTP-MEG2 PTPase MEG2 Protein-tyrosine phosphatase MEG2 (PTP-Meg2) | Tyrosine-protein phosphatase non-receptor type 9
Type:
Mol. Mass.:
68030.33
Organism:
Homo sapiens (Human)
Description:
P43378
Residue:
593
  
Inhibitor
Name:
BDBM50425819
Synonyms:
CHEMBL2316904
Type:
Small organic molecule
Emp. Form.:
C23H13FO4
Mol. Mass.:
372.3453
SMILES:
OC(=O)c1cc2c(C#Cc3cccc(F)c3)c(oc2cc1O)-c1ccccc1
: