Target
Tyrosine-protein kinase receptor UFO
Ligand
BDBM50425832
Substrate
Meas. Tech.
ChEMBL_937897 (CHEMBL2317037)
IC50
61±n/a nM
Citation
 Powell, NAHoffman, JKCiske, FLKaufman, MDKohrt, JTQuin, JSheehan, DJDelaney, ABaxi, SMCatana, CMcConnell, POhren, JPerrin, LAEdmunds, JJ Highly selective 2,4-diaminopyrimidine-5-carboxamide inhibitors of Sky kinase. Bioorg Med Chem Lett 23:1046-50 (2013)  
Target
Name:
Tyrosine-protein kinase receptor UFO
Synonyms:
AXL TEL/AXL UFO | UFO_HUMAN
Type:
Enzyme
Mol. Mass.:
98316.97
Organism:
Homo sapiens (Human)
Description:
P30530
Residue:
894
  
Inhibitor
Name:
BDBM50425832
Synonyms:
CHEMBL2312290
Type:
Small organic molecule
Emp. Form.:
C27H38N6O4
Mol. Mass.:
510.6284
SMILES:
COc1ccc(CCNc2ncc(C(=O)NCCCN3CCCC3=O)c(NC3CCCC3)n2)cc1OC
: