Target
Mitogen-activated protein kinase kinase kinase 9
Ligand
BDBM50425862
Substrate
Meas. Tech.
ChEMBL_933539 (CHEMBL2319701)
IC50
160±n/a nM
Citation
 Powell, NAHoffman, JKCiske, FLKohrt, JTBaxi, SMPeng, YWZhong, MCatana, COhren, JPerrin, LAEdmunds, JJ Optimization of highly selective 2,4-diaminopyrimidine-5-carboxamide inhibitors of Sky kinase. Bioorg Med Chem Lett 23:1051-5 (2013)  
Target
Name:
Mitogen-activated protein kinase kinase kinase 9
Synonyms:
M3K9_HUMAN MLK1 Mitogen-activated protein kinase kinase kinase 9 (MLK1) PRKE1
Type:
protein
Mol. Mass.:
121881.51
Organism:
Homo sapiens (Human)
Description:
P80192
Residue:
1104
  
Inhibitor
Name:
BDBM50425862
Synonyms:
CHEMBL2312654
Type:
Small organic molecule
Emp. Form.:
C22H26Cl2N6O
Mol. Mass.:
461.387
SMILES:
CN(C)C1CCC(CC1)Nc1nc(Nc2cc(Cl)cc(Cl)c2)ncc1-c1cc(C)no1
: