Target
Albumin
Ligand
BDBM50425935
Substrate
Meas. Tech.
ChEMBL_934194 (CHEMBL2319454)
IC50
83900±n/a nM
Citation
 Shantharam, CSSuyoga Vardhan, DMSuhas, RSridhara, MBGowda, DC Inhibition of protein glycation by urea and thiourea derivatives of glycine/proline conjugated benzisoxazole analogue - synthesis and structure-activity studies. Eur J Med Chem 60:325-32 (2013)  
Target
Name:
Albumin
Synonyms:
ALB Serum albumin | serum albumin precursor
Type:
PROTEIN
Mol. Mass.:
69288.15
Organism:
Bos taurus
Description:
ChEMBL_1502598
Residue:
607
  
Inhibitor
Name:
BDBM50425935
Synonyms:
CHEMBL2313725
Type:
Small organic molecule
Emp. Form.:
C21H20ClFN4O3
Mol. Mass.:
430.86
SMILES:
Fc1ccc2c(noc2c1)C1CCN(CC1)C(=O)CNC(=O)Nc1ccc(Cl)cc1
: