Target
Albumin
Ligand
BDBM50425938
Substrate
Meas. Tech.
ChEMBL_934194 (CHEMBL2319454)
IC50
75800±n/a nM
Citation
 Shantharam, CSSuyoga Vardhan, DMSuhas, RSridhara, MBGowda, DC Inhibition of protein glycation by urea and thiourea derivatives of glycine/proline conjugated benzisoxazole analogue - synthesis and structure-activity studies. Eur J Med Chem 60:325-32 (2013)  
Target
Name:
Albumin
Synonyms:
ALB Serum albumin | serum albumin precursor
Type:
PROTEIN
Mol. Mass.:
69288.15
Organism:
Bos taurus
Description:
ChEMBL_1502598
Residue:
607
  
Inhibitor
Name:
BDBM50425938
Synonyms:
CHEMBL2313721
Type:
Small organic molecule
Emp. Form.:
C21H20F2N4O3
Mol. Mass.:
414.4053
SMILES:
Fc1ccc(NC(=O)NCC(=O)N2CCC(CC2)c2noc3cc(F)ccc23)cc1
: