Target
Induced myeloid leukemia cell differentiation protein Mcl-1
Ligand
BDBM50425953
Substrate
Meas. Tech.
ChEMBL_934367 (CHEMBL2320595)
Ki
4830±n/a nM
Citation
 Zhang, ZLiu, CLi, XSong, TWu, ZLiang, XZhao, YShen, XChen, H Fragment-based design, synthesis, and biological evaluation of N-substituted-5-(4-isopropylthiophenol)-2-hydroxynicotinamide derivatives as novel Mcl-1 inhibitors. Eur J Med Chem 60:410-20 (2013)  
Target
Name:
Induced myeloid leukemia cell differentiation protein Mcl-1
Synonyms:
BCL2L3 Bcl-2-like protein 3 (Mcl-1) Bcl2-L-3 MCL1 Mcl-1 Myeloid cell leukemia sequence 1 (BCL2-related) | mcl1/EAT
Type:
Membrane; Single-pass membrane protein
Mol. Mass.:
37332.87
Organism:
Homo sapiens (Human)
Description:
Q07820
Residue:
350
  
Inhibitor
Name:
BDBM50425953
Synonyms:
CHEMBL2314378
Type:
Small organic molecule
Emp. Form.:
C12H7BrN2OS
Mol. Mass.:
307.166
SMILES:
Brc1ccc(Sc2c[nH]c(=O)c(c2)C#N)cc1
: