Target
Cannabinoid receptor 1
Ligand
BDBM50426094
Substrate
Meas. Tech.
ChEMBL_935498 (CHEMBL2319557)
Ki
5200±n/a nM
Citation
 Aghazadeh Tabrizi, MBaraldi, PGSaponaro, GMoorman, ARRomagnoli, RPreti, DBaraldi, SCorciulo, CVincenzi, FBorea, PAVarani, K Design, synthesis, and pharmacological properties of new heteroarylpyridine/heteroarylpyrimidine derivatives as CB(2) cannabinoid receptor partial agonists. J Med Chem 56:1098-112 (2013)  
Target
Name:
Cannabinoid receptor 1
Synonyms:
Brain-type cannabinoid receptor CB-R CNR1_RAT Cannabinoid receptor Cnr1 | Skr6
Type:
G Protein-Coupled Receptor (GPCR)
Mol. Mass.:
52856.55
Organism:
Rattus norvegicus (rat)
Description:
P20272
Residue:
473
  
Inhibitor
Name:
BDBM50426094
Synonyms:
CHEMBL2316273
Type:
Small organic molecule
Emp. Form.:
C20H30N4O2
Mol. Mass.:
358.4778
SMILES:
CCCCCn1cc(C(=O)NC2CCCCCC2)c(=O)c2cnn(C)c12
: