Target
Cannabinoid receptor 2
Ligand
BDBM50426097
Substrate
Meas. Tech.
ChEMBL_935496 (CHEMBL2319555)
Ki
4033±n/a nM
Citation
 Aghazadeh Tabrizi, MBaraldi, PGSaponaro, GMoorman, ARRomagnoli, RPreti, DBaraldi, SCorciulo, CVincenzi, FBorea, PAVarani, K Design, synthesis, and pharmacological properties of new heteroarylpyridine/heteroarylpyrimidine derivatives as CB(2) cannabinoid receptor partial agonists. J Med Chem 56:1098-112 (2013)  
Target
Name:
Cannabinoid receptor 2
Synonyms:
CANNABINOID CB2 CB2 Cannabinoid CB2 receptor Cnr2 | rCB2
Type:
Enzyme
Mol. Mass.:
39366.68
Organism:
Rattus norvegicus (Rat)
Description:
Q9QZN9
Residue:
360
  
Inhibitor
Name:
BDBM50426097
Synonyms:
CHEMBL2316270
Type:
Small organic molecule
Emp. Form.:
C23H36N4O2
Mol. Mass.:
400.5575
SMILES:
CCCCCn1cc(C(=O)NC2CCCCC2)c(=O)c2c(nn(C)c12)C(C)(C)C
: