Target
Cannabinoid receptor 1
Ligand
BDBM50426101
Substrate
Meas. Tech.
ChEMBL_935497 (CHEMBL2319556)
Ki
>10000±n/a nM
Citation
 Aghazadeh Tabrizi, MBaraldi, PGSaponaro, GMoorman, ARRomagnoli, RPreti, DBaraldi, SCorciulo, CVincenzi, FBorea, PAVarani, K Design, synthesis, and pharmacological properties of new heteroarylpyridine/heteroarylpyrimidine derivatives as CB(2) cannabinoid receptor partial agonists. J Med Chem 56:1098-112 (2013)  
Target
Name:
Cannabinoid receptor 1
Synonyms:
CANN6 CB-R CNR CNR1_HUMAN Cannabinoid receptor Cannabinoid receptor 1 (brain)
Type:
G Protein-Coupled Receptor (GPCR)
Mol. Mass.:
52868.96
Organism:
Homo sapiens (Human)
Description:
P21554
Residue:
472
  
Inhibitor
Name:
BDBM50426101
Synonyms:
CHEMBL2316266
Type:
Small organic molecule
Emp. Form.:
C20H23FN4O2
Mol. Mass.:
370.4206
SMILES:
CCCCCn1cc(C(=O)Nc2ccc(F)cc2)c(=O)c2c(C)nn(C)c12
: