Target
Cannabinoid receptor 2
Ligand
BDBM50426110
Substrate
Meas. Tech.
ChEMBL_935495 (CHEMBL2319554)
Ki
372±n/a nM
Citation
 Aghazadeh Tabrizi, MBaraldi, PGSaponaro, GMoorman, ARRomagnoli, RPreti, DBaraldi, SCorciulo, CVincenzi, FBorea, PAVarani, K Design, synthesis, and pharmacological properties of new heteroarylpyridine/heteroarylpyrimidine derivatives as CB(2) cannabinoid receptor partial agonists. J Med Chem 56:1098-112 (2013)  
Target
Name:
Cannabinoid receptor 2
Synonyms:
CANNABINOID CB2 CB2 CB2B CNR2_HUMAN Cannabinoid CB2 receptor Cannabinoid receptor 2 (CB2R) | hCB2
Type:
G Protein-Coupled Receptor (GPCR)
Mol. Mass.:
39690.94
Organism:
Homo sapiens (Human)
Description:
P34972
Residue:
360
  
Inhibitor
Name:
BDBM50426110
Synonyms:
CHEMBL2316295
Type:
Small organic molecule
Emp. Form.:
C21H32N4O2
Mol. Mass.:
372.5044
SMILES:
CCCCCn1cc(C(=O)NCC2CCCCC2)c(=O)c2c(C)nn(C)c12
: