Target
Threonine--tRNA ligase
Ligand
BDBM50426192
Substrate
Meas. Tech.
ChEMBL_935847 (CHEMBL2317883)
Ki
>50000±n/a nM
Citation
 Teng, MHilgers, MTCunningham, MLBorchardt, ALocke, JBAbraham, SHaley, GKwan, BPHall, CHough, GWShaw, KJFinn, J Identification of bacteria-selective threonyl-tRNA synthetase substrate inhibitors by structure-based design. J Med Chem 56:1748-60 (2013)  
Target
Name:
Threonine--tRNA ligase
Synonyms:
SYT_YERPE YP_2221 y1903
Type:
PROTEIN
Mol. Mass.:
73649.43
Organism:
Yersinia pestis
Description:
ChEMBL_935847
Residue:
642
  
Inhibitor
Name:
BDBM50426192
Synonyms:
CHEMBL2316968
Type:
Small organic molecule
Emp. Form.:
C16H18N4O5S
Mol. Mass.:
378.403
SMILES:
C[C@@H](O)[C@H](O)C(=O)NS(=O)(=O)\C=C\c1cccc(c1)-c1cc(N)ncn1
: