Target
Excitatory amino acid transporter 3
Ligand
BDBM50426296
Substrate
Meas. Tech.
ChEMBL_936435 (CHEMBL2317644)
IC50
>300000±n/a nM
Citation
 Assaf, ZLarsen, APVenskutonyte, RHan, LAbrahamsen, BNielsen, BGajhede, MKastrup, JSJensen, AAPickering, DSFrydenvang, KGefflaut, TBunch, L Chemoenzymatic synthesis of new 2,4-syn-functionalized (S)-glutamate analogues and structure-activity relationship studies at ionotropic glutamate receptors and excitatory amino acid transporters. J Med Chem 56:1614-28 (2013)  
Target
Name:
Excitatory amino acid transporter 3
Synonyms:
EAA3_HUMAN EAAT3 HEAAC1 | SLC1A1
Type:
Enzyme Catalytic Domain
Mol. Mass.:
57096.71
Organism:
Homo sapiens (Human)
Description:
Excitatory Amino Acid EAAT3 0 HUMAN::P43005
Residue:
524
  
Inhibitor
Name:
BDBM50426296
Synonyms:
CHEMBL2312396
Type:
Small organic molecule
Emp. Form.:
C11H16N2O5
Mol. Mass.:
256.2551
SMILES:
N[C@@H](C[C@@H](CCC(=O)NCC#C)C(O)=O)C(O)=O
: