Target
cAMP-specific 3',5'-cyclic phosphodiesterase 4A
Ligand
BDBM50426302
Substrate
Meas. Tech.
ChEMBL_936449 (CHEMBL2317658)
Ki
371000±n/a nM
Citation
 Wei, LWasilewski, EChakka, SKBello, AMMoscarello, MAKotra, LP Novel inhibitors of protein arginine deiminase with potential activity in multiple sclerosis animal model. J Med Chem 56:1715-22 (2013)  
Target
Name:
cAMP-specific 3',5'-cyclic phosphodiesterase 4A
Synonyms:
3',5'-cyclic phosphodiesterase PDE46 PDE4A_HUMAN Phosphodiesterase 4A | Phosphodiesterase 4A (PDE4)
Type:
Enzyme
Mol. Mass.:
98113.27
Organism:
Homo sapiens (Human)
Description:
P27815
Residue:
886
  
Inhibitor
Name:
BDBM50426302
Synonyms:
CHEMBL2312698
Type:
Small organic molecule
Emp. Form.:
C10H18N4O2
Mol. Mass.:
226.2755
SMILES:
CC1(C)NC(=O)N(CN2CCNCC2)C1=O
: