Target
cAMP-specific 3',5'-cyclic phosphodiesterase 4A
Ligand
BDBM50426301
Substrate
Meas. Tech.
ChEMBL_936451 (CHEMBL2317660)
Ki
153000±n/a nM
Citation
 Wei, LWasilewski, EChakka, SKBello, AMMoscarello, MAKotra, LP Novel inhibitors of protein arginine deiminase with potential activity in multiple sclerosis animal model. J Med Chem 56:1715-22 (2013)  
Target
Name:
cAMP-specific 3',5'-cyclic phosphodiesterase 4A
Synonyms:
3',5'-cyclic phosphodiesterase PDE46 PDE4A_HUMAN Phosphodiesterase 4A | Phosphodiesterase 4A (PDE4)
Type:
Enzyme
Mol. Mass.:
98113.27
Organism:
Homo sapiens (Human)
Description:
P27815
Residue:
886
  
Inhibitor
Name:
BDBM50426301
Synonyms:
CHEMBL1402123
Type:
Small organic molecule
Emp. Form.:
C11H14N4S
Mol. Mass.:
234.321
SMILES:
CC1CCc2c(C1)sc1ncn(N)c(=N)c21
: