Target
Apoptosis regulator Bcl-2
Ligand
BDBM50426412
Substrate
Meas. Tech.
ChEMBL_940158 (CHEMBL2328333)
Kd
10.0±n/a nM
Citation
 Touré, BBMiller-Moslin, KYusuff, NPerez, LDoré, MJoud, CMichael, WDiPietro, Lvan der Plas, SMcEwan, MLenoir, FHoe, MKarki, RSpringer, CSullivan, JLevine, KFiorilla, CXie, XKulathila, RHerlihy, KPorter, DVisser, M The role of the acidity of N-heteroaryl sulfonamides as inhibitors of bcl-2 family protein-protein interactions. ACS Med Chem Lett 4:186-90 (2013)  
Target
Name:
Apoptosis regulator Bcl-2
Synonyms:
Apoptosis regulator Bcl-2 Protein BCL-2 BCL2_HUMAN | Bcl-2 Protein
Type:
Homodimer or heterodimer
Mol. Mass.:
26269.11
Organism:
Homo sapiens (Human)
Description:
P10415
Residue:
239
  
Inhibitor
Name:
BDBM50426412
Synonyms:
CHEMBL2322022
Type:
Small organic molecule
Emp. Form.:
C45H48ClF6N7O4S3
Mol. Mass.:
996.546
SMILES:
CN(C)CC[C@H](CSc1ccccc1)Nc1ccc(cc1S(=O)(=O)C(F)(F)F)S(=O)(=O)Nc1nc(nc2CN(CCc12)C1CCN(Cc2ccccc2-c2ccc(Cl)cc2)CC1)C(F)(F)F
: