Target
Gamma-aminobutyric acid receptor subunit alpha-1
Ligand
BDBM50156083
Substrate
Meas. Tech.
ChEMBL_938808 (CHEMBL2327952)
Ki
0.80±n/a nM
Citation
 Bagal, SKBrown, ADCox, PJOmoto, KOwen, RMPryde, DCSidders, BSkerratt, SEStevens, EBStorer, RISwain, NA Ion channels as therapeutic targets: a drug discovery perspective. J Med Chem 56:593-624 (2013)  
Target
Name:
Gamma-aminobutyric acid receptor subunit alpha-1
Synonyms:
Benzodiazepine central GABA A Benzodiazepine liver GABA(A) receptor subunit alpha-1 GABA-A receptor GBRA1_HUMAN TBPS | agonist GABA site
Type:
Protein
Mol. Mass.:
51817.35
Organism:
Homo sapiens (Human)
Description:
P14867
Residue:
456
  
Inhibitor
Name:
BDBM50156083
Synonyms:
3-tert-Butyl-7-(5-methyl-isoxazol-3-yl)-2-(2-methyl-2H-[1,2,4]triazol-3-ylmethoxy)-pyrazolo[1,5-d][1,2,4]triazine CHEMBL363211
Type:
Small organic molecule
Emp. Form.:
C17H20N8O2
Mol. Mass.:
368.3931
SMILES:
Cc1cc(no1)-c1nncc2c(c(OCc3ncnn3C)nn12)C(C)(C)C
: