Target
Transient receptor potential cation channel subfamily M member 8
Ligand
BDBM50426573
Substrate
Meas. Tech.
ChEMBL_938819 (CHEMBL2327963)
IC50
4.0±n/a nM
Citation
 Bagal, SKBrown, ADCox, PJOmoto, KOwen, RMPryde, DCSidders, BSkerratt, SEStevens, EBStorer, RISwain, NA Ion channels as therapeutic targets: a drug discovery perspective. J Med Chem 56:593-624 (2013)  
Target
Name:
Transient receptor potential cation channel subfamily M member 8
Synonyms:
LTRPC6 TRPM8_HUMAN Transient receptor potential M8 protein (TRPM8) Transient receptor potential cation channel subfamily M member 8 (TRPM8)
Type:
Enzyme
Mol. Mass.:
127693.26
Organism:
Homo sapiens (Human)
Description:
Q7Z2W7
Residue:
1104
  
Inhibitor
Name:
BDBM50426573
Synonyms:
CHEMBL2324349 | US9434711, 306
Type:
Small organic molecule
Emp. Form.:
C24H17F4NO4S2
Mol. Mass.:
523.52
SMILES:
Cc1c(sc2ccccc12)N(Cc1ccc(F)c(c1)C(F)(F)F)S(=O)(=O)c1ccc(cc1)C(O)=O
: