Target
Potassium voltage-gated channel subfamily H member 2
Ligand
BDBM50371391
Substrate
Meas. Tech.
ChEMBL_938826 (CHEMBL2328095)
IC50
>1000±n/a nM
Citation
 Bagal, SKBrown, ADCox, PJOmoto, KOwen, RMPryde, DCSidders, BSkerratt, SEStevens, EBStorer, RISwain, NA Ion channels as therapeutic targets: a drug discovery perspective. J Med Chem 56:593-624 (2013)  
Target
Name:
Potassium voltage-gated channel subfamily H member 2
Synonyms:
1,3-beta-glucan synthase component GLS2 ERG Eag-related protein 1 Ether-a-go-go-related gene (HERG) Ether-a-go-go-related gene potassium channel 1 Ether-a-go-go-related gene potassium channel 1 (hERG1) Ether-a-go-go-related protein 1 H-ERG KCNH2 Potassium voltage-gated channel subfamily H member 2 (hERG) Voltage-gated potassium channel subunit Kv11.1 hERG Potassium Channel 1 | putative potassium channel subunit
Type:
Multi-pass membrane protein
Mol. Mass.:
126672.65
Organism:
Homo sapiens (Human)
Description:
Q12809
Residue:
1159
  
Inhibitor
Name:
BDBM50371391
Synonyms:
SENICAPOC
Type:
Small organic molecule
Emp. Form.:
C20H15F2NO
Mol. Mass.:
323.336
SMILES:
NC(=O)C(c1ccccc1)(c1ccc(F)cc1)c1ccc(F)cc1
: