Target
17-beta-hydroxysteroid dehydrogenase type 1
Ligand
BDBM50426594
Substrate
Meas. Tech.
ChEMBL_938947 (CHEMBL2328436)
IC50
4337±n/a nM
Citation
 Marchais-Oberwinkler, SXu, KWetzel, MPerspicace, ENegri, MMeyer, AOdermatt, AMöller, GAdamski, JHartmann, RW Structural optimization of 2,5-thiophene amides as highly potent and selective 17ß-hydroxysteroid dehydrogenase type 2 inhibitors for the treatment of osteoporosis. J Med Chem 56:167-81 (2013)  
Target
Name:
17-beta-hydroxysteroid dehydrogenase type 1
Synonyms:
17-beta-HSD 1 17-beta-hydroxysteroid dehydrogenase type 1 20-alpha-HSD E17KSR EDH17B1 EDHB17 Estradiol 17-beta-dehydrogenase 1 (17beta-HSD1) Placental 17-beta-hydroxysteroid dehydrogenase | SDR28C1
Type:
Enzyme
Mol. Mass.:
34945.13
Organism:
Homo sapiens (Human)
Description:
P14061
Residue:
328
  
Inhibitor
Name:
BDBM50426594
Synonyms:
CHEMBL2324683
Type:
Small organic molecule
Emp. Form.:
C19H17NO2S
Mol. Mass.:
323.409
SMILES:
COc1cccc(c1)N(C)C(=O)c1ccc(s1)-c1ccccc1
: