Target
Tyrosine-protein kinase JAK1
Ligand
BDBM50426606
Substrate
Meas. Tech.
ChEMBL_939262 (CHEMBL2329569)
IC50
45±n/a nM
Citation
 Soth, MHermann, JCYee, CAlam, MBarnett, JWBerry, PBrowner, MFFrank, KFrauchiger, SHarris, SHe, YHekmat-Nejad, MHendricks, THenningsen, RHilgenkamp, RHo, HHoffman, AHsu, PYHu, DQItano, AJaime-Figueroa, SJahangir, AJin, SKuglstatter, AKutach, AKLiao, CLynch, SMenke, JNiu, LPatel, VRailkar, ARoy, DShao, AShaw, DSteiner, SSun, YTan, SLWang, SVu, MD 3-Amido pyrrolopyrazine JAK kinase inhibitors: development of a JAK3 vs JAK1 selective inhibitor and evaluation in cellular and in vivo models. J Med Chem 56:345-56 (2013)  
Target
Name:
Tyrosine-protein kinase JAK1
Synonyms:
JAK-1 JAK1A JAK1_HUMAN Janus kinase 1 (JAK1) | Janus kinase 1 JAK1
Type:
Protein
Mol. Mass.:
133293.73
Organism:
Homo sapiens (Human)
Description:
P23458
Residue:
1154
  
Inhibitor
Name:
BDBM50426606
Synonyms:
CHEMBL2325903
Type:
Small organic molecule
Emp. Form.:
C16H22N4O
Mol. Mass.:
286.3721
SMILES:
C[C@H](NC(=O)c1c[nH]c2ncc(nc12)C1CC1)C(C)(C)C
: