Target
Alpha-1A adrenergic receptor
Ligand
BDBM50426619
Substrate
Meas. Tech.
ChEMBL_939354 (CHEMBL2327489)
Ki
0.160000±n/a nM
Citation
 Jørgensen, MJørgensen, PNChristoffersen, CTJensen, KGBalle, TBang-Andersen, B Discovery of novela1-adrenoceptor ligands based on the antipsychotic sertindole suitable for labeling as PET ligands. Bioorg Med Chem 21:196-204 (2012)  
Target
Name:
Alpha-1A adrenergic receptor
Synonyms:
ADA1A_BOVIN ADRA1C Alpha 1A-adrenoreceptor Cerebral cortex alpha adrenergic receptor | adrenergic Alpha1
Type:
Enzyme Catalytic Domain
Mol. Mass.:
51492.08
Organism:
CALF
Description:
adrenergic Alpha1 0 CALF
Residue:
466
  
Inhibitor
Name:
BDBM50426619
Synonyms:
CHEMBL2326175
Type:
Small organic molecule
Emp. Form.:
C23H24FN5
Mol. Mass.:
389.4686
SMILES:
CN1CCC(CC1)c1cn(-c2ccc(F)cc2)c2ccc(cc12)-c1ncn(C)n1
: