Target
5-hydroxytryptamine receptor 3A
Ligand
BDBM50426730
Substrate
Meas. Tech.
ChEMBL_940560 (CHEMBL2327178)
Kd
83±n/a nM
Citation
 Silva-Lopez, EIBarden, AOBrozik, JA Near native binding of a fluorescent serotonin conjugate to serotonin type 3 receptors. Bioorg Med Chem Lett 23:773-5 (2013)  
Target
Name:
5-hydroxytryptamine receptor 3A
Synonyms:
5-HT-3 5-HT3A 5-hydroxytryptamine receptor 3 (5-HT3) 5-hydroxytryptamine receptor 3A (5HT3A) 5HT3R HTR3A Serotonin 3 receptor (5HT3) Serotonin-gated ion channel receptor | Serotonin-gated ion channel receptor 3
Type:
Protein
Mol. Mass.:
55283.27
Organism:
Homo sapiens (Human)
Description:
P46098
Residue:
478
  
Inhibitor
Name:
BDBM50426730
Synonyms:
CHEMBL2322133
Type:
Small organic molecule
Emp. Form.:
C43H48N6O6
Mol. Mass.:
744.8778
SMILES:
CN(C)c1ccc2c(-c3ccc(cc3C([O-])=O)C(=O)NCCCCCNC(=O)CCn3cc(CCN)c4cc(O)ccc34)c3ccc(cc3oc2c1)=[N+](C)C
: