Target
Cholinesterase
Ligand
BDBM50426839
Substrate
Meas. Tech.
ChEMBL_938312 (CHEMBL2328986)
IC50
48800±n/a nM
Citation
 ÖzturanÖzer, ETan, OUOzadali, KKüçükkilinç, TBalkan, AUçar, G Synthesis, molecular modeling and evaluation of novel N'-2-(4-benzylpiperidin-/piperazin-1-yl)acylhydrazone derivatives as dual inhibitors for cholinesterases and Aß aggregation. Bioorg Med Chem Lett 23:440-3 (2012)  
Target
Name:
Cholinesterase
Synonyms:
BCHE CHLE_HORSE | Cholinesterase
Type:
Enzyme
Mol. Mass.:
65643.35
Organism:
Equus caballus (Horse)
Description:
P81908
Residue:
574
  
Inhibitor
Name:
BDBM50426839
Synonyms:
CHEMBL2323355
Type:
Small organic molecule
Emp. Form.:
C22H27N3O2
Mol. Mass.:
365.4687
SMILES:
COc1ccc(\C=N\NC(=O)CN2CCC(Cc3ccccc3)CC2)cc1
: