Target
Acetylcholinesterase
Ligand
BDBM50426839
Substrate
Meas. Tech.
ChEMBL_938311 (CHEMBL2328985)
IC50
73500±n/a nM
Citation
 ÖzturanÖzer, ETan, OUOzadali, KKüçükkilinç, TBalkan, AUçar, G Synthesis, molecular modeling and evaluation of novel N'-2-(4-benzylpiperidin-/piperazin-1-yl)acylhydrazone derivatives as dual inhibitors for cholinesterases and Aß aggregation. Bioorg Med Chem Lett 23:440-3 (2012)  
Target
Name:
Acetylcholinesterase
Synonyms:
ACES_HUMAN Acetylcholinesterase (AChE) | Acetylcholinesterase (human AChE)
Type:
Enzyme
Mol. Mass.:
67792.70
Organism:
Homo sapiens (Human)
Description:
P22303
Residue:
614
  
Inhibitor
Name:
BDBM50426839
Synonyms:
CHEMBL2323355
Type:
Small organic molecule
Emp. Form.:
C22H27N3O2
Mol. Mass.:
365.4687
SMILES:
COc1ccc(\C=N\NC(=O)CN2CCC(Cc3ccccc3)CC2)cc1
: