Target
Proteasome subunit beta type-2
Ligand
BDBM50426993
Substrate
Meas. Tech.
ChEMBL_939296 (CHEMBL2327093)
IC50
200±n/a nM
Citation
 Geurink, PPvan der Linden, WAMirabella, ACGallastegui, Nde Bruin, GBlom, AEVoges, MJMock, EDFlorea, BIvan der Marel, GADriessen, Cvan der Stelt, MGroll, MOverkleeft, HSKisselev, AF Incorporation of non-natural amino acids improves cell permeability and potency of specific inhibitors of proteasome trypsin-like sites. J Med Chem 56:1262-75 (2013)  
Target
Name:
Proteasome subunit beta type-2
Synonyms:
20S proteasome PSMB2 | Proteasome Macropain subunit
Type:
PROTEIN
Mol. Mass.:
22837.53
Organism:
Homo sapiens (Human)
Description:
ChEMBL_1294233
Residue:
201
  
Inhibitor
Name:
BDBM50426993
Synonyms:
CHEMBL2326539
Type:
Small organic molecule
Emp. Form.:
C28H38N4O7S
Mol. Mass.:
574.689
SMILES:
CC(C)[C@H](NC(=O)c1cccc(O)c1C)C(=O)N[C@@H](CO)C(=O)N[C@@H](Cc1ccc(CN)cc1)\C=C\S(C)(=O)=O
: