Target
Glucose-dependent insulinotropic receptor
Ligand
BDBM50427059
Substrate
Meas. Tech.
ChEMBL_940080 (CHEMBL2328014)
EC50
1.5±n/a nM
Citation
 Yang, ZFang, YPham, TALee, JPark, H Synthesis and biological evaluation of 5-nitropyrimidine analogs with azabicyclic substituents as GPR119 agonists. Bioorg Med Chem Lett 23:1519-21 (2013)  
Target
Name:
Glucose-dependent insulinotropic receptor
Synonyms:
G-protein coupled receptor 119 (GPR119) GPR119 | Glucose-dependent insulinotropic receptor
Type:
Protein
Mol. Mass.:
36901.49
Organism:
Homo sapiens (Human)
Description:
Q8TDV5
Residue:
335
  
Inhibitor
Name:
BDBM50427059
Synonyms:
CHEMBL2322837
Type:
Small organic molecule
Emp. Form.:
C23H28FN5O7S
Mol. Mass.:
537.561
SMILES:
CC(C)(C)OC(=O)N1[C@H]2CC[C@H]1CC(C2)Oc1ncnc(Nc2ccc(cc2F)S(C)(=O)=O)c1[N+]([O-])=O
: