Target
C-C chemokine receptor type 1
Ligand
BDBM50427077
Substrate
Meas. Tech.
ChEMBL_940424 (CHEMBL2329311)
IC50
10.0±n/a nM
Citation
 Pennell, AMAggen, JBSen, SChen, WXu, YSullivan, ELi, LGreenman, KCharvat, THansen, DDairaghi, DJWright, JJZhang, P 1-(4-Phenylpiperazin-1-yl)-2-(1H-pyrazol-1-yl)ethanones as novel CCR1 antagonists. Bioorg Med Chem Lett 23:1228-31 (2013)  
Target
Name:
C-C chemokine receptor type 1
Synonyms:
C-C CKR-1 CC-CKR-1 CCR1 CD_antigen=CD191 CMKR1 LD78 receptor Macrophage inflammatory protein 1-alpha receptor SCYAR1
Type:
Enzyme
Mol. Mass.:
41180.69
Organism:
Homo sapiens (Human)
Description:
P32246
Residue:
355
  
Inhibitor
Name:
BDBM50427077
Synonyms:
CHEMBL2322847
Type:
Small organic molecule
Emp. Form.:
C18H19Cl2N5O2
Mol. Mass.:
408.282
SMILES:
COc1cc(ccc1Cl)N1CCN(CC1)C(=O)Cn1nc(C#N)c(Cl)c1C
: