Target
Serine racemase
Ligand
BDBM50427212
Substrate
Meas. Tech.
ChEMBL_938786 (CHEMBL2327930)
IC50
2820000±n/a nM
Citation
 Katane, MOsaka, NMatsuda, SMaeda, KKawata, TSaitoh, YSekine, MFuruchi, TDoi, IHirono, SHomma, H Identification of novel D-amino acid oxidase inhibitors by in silico screening and their functional characterization in vitro. J Med Chem 56:1894-907 (2013)  
Target
Name:
Serine racemase
Synonyms:
SRR | SRR_HUMAN
Type:
PROTEIN
Mol. Mass.:
36565.80
Organism:
Homo sapiens (Human)
Description:
ChEMBL_1516972
Residue:
340
  
Inhibitor
Name:
BDBM50427212
Synonyms:
(2S,3R)-2,3-Dihydroxysuccinic Acid Meso-Tartrate
Type:
Small organic molecule
Emp. Form.:
C4H6O6
Mol. Mass.:
150.0868
SMILES:
O[C@@H]([C@@H](O)C(O)=O)C(O)=O
: