Target
Serine racemase
Ligand
BDBM50074328
Substrate
Meas. Tech.
ChEMBL_938786 (CHEMBL2327930)
IC50
8213000±n/a nM
Citation
 Katane, MOsaka, NMatsuda, SMaeda, KKawata, TSaitoh, YSekine, MFuruchi, TDoi, IHirono, SHomma, H Identification of novel D-amino acid oxidase inhibitors by in silico screening and their functional characterization in vitro. J Med Chem 56:1894-907 (2013)  
Target
Name:
Serine racemase
Synonyms:
SRR | SRR_HUMAN
Type:
PROTEIN
Mol. Mass.:
36565.80
Organism:
Homo sapiens (Human)
Description:
ChEMBL_1516972
Residue:
340
  
Inhibitor
Name:
BDBM50074328
Synonyms:
CHEMBL164585 | Thiophene-3-carboxylic acid
Type:
Small organic molecule
Emp. Form.:
C5H4O2S
Mol. Mass.:
128.149
SMILES:
OC(=O)c1ccsc1
: