Target
Carbonic anhydrase 1
Ligand
BDBM10888
Substrate
Meas. Tech.
ChEMBL_938521 (CHEMBL2327205)
Ki
56±n/a nM
Citation
 Pan, PVermelho, ABCapaci Rodrigues, GScozzafava, ATolvanen, MEParkkila, SCapasso, CSupuran, CT Cloning, characterization, and sulfonamide and thiol inhibition studies of ana-carbonic anhydrase from Trypanosoma cruzi, the causative agent of Chagas disease. J Med Chem 56:1761-71 (2013)  
Target
Name:
Carbonic anhydrase 1
Synonyms:
CA-I CAB Carbonate dehydratase I Carbonic anhydrase 1 (CA I) Carbonic anhydrase 1 (Recombinant CA I) Carbonic anhydrase B Carbonic anhydrase I (CA I) Carbonic anhydrase I (CAI) Carbonic anhydrase isoenzyme I (hCA I) | hCA
Type:
Enzyme
Mol. Mass.:
28873.37
Organism:
Homo sapiens (Human)
Description:
P00915
Residue:
261
  
Inhibitor
Name:
BDBM10888
Synonyms:
1,2-benzoxazol-3-ylmethanesulfonamide SPR_2 Zonisamide Zonisamide (ZNS) Zonisamide, ZNS
Type:
Small organic molecule
Emp. Form.:
C8H8N2O3S
Mol. Mass.:
212.226
SMILES:
NS(=O)(=O)Cc1noc2ccccc12
: