Target
Carbonic anhydrase 1
Ligand
BDBM10873
Substrate
Meas. Tech.
ChEMBL_938521 (CHEMBL2327205)
Ki
109±n/a nM
Citation
 Pan, PVermelho, ABCapaci Rodrigues, GScozzafava, ATolvanen, MEParkkila, SCapasso, CSupuran, CT Cloning, characterization, and sulfonamide and thiol inhibition studies of ana-carbonic anhydrase from Trypanosoma cruzi, the causative agent of Chagas disease. J Med Chem 56:1761-71 (2013)  
Target
Name:
Carbonic anhydrase 1
Synonyms:
CA-I CAB Carbonate dehydratase I Carbonic anhydrase 1 (CA I) Carbonic anhydrase 1 (Recombinant CA I) Carbonic anhydrase B Carbonic anhydrase I (CA I) Carbonic anhydrase I (CAI) Carbonic anhydrase isoenzyme I (hCA I) | hCA
Type:
Enzyme
Mol. Mass.:
28873.37
Organism:
Homo sapiens (Human)
Description:
P00915
Residue:
261
  
Inhibitor
Name:
BDBM10873
Synonyms:
4-[(2-aminopyrimidin-4-yl)amino]benzene-1-sulfonamide US9616064, Compound 1aa | aromatic/heteroaromatic sulfonamide 18
Type:
Small organic molecule
Emp. Form.:
C10H11N5O2S
Mol. Mass.:
265.292
SMILES:
Nc1nccc(Nc2ccc(cc2)S(N)(=O)=O)n1
: