Target
Potassium voltage-gated channel subfamily H member 2
Ligand
BDBM50427282
Substrate
Meas. Tech.
ChEMBL_938571 (CHEMBL2327410)
IC50
>25000±n/a nM
Citation
 Good, JAWang, FRath, OKaan, HYTalapatra, SKPodgórski, DMacKay, SPKozielski, F Optimized S-trityl-L-cysteine-based inhibitors of kinesin spindle protein with potent in vivo antitumor activity in lung cancer xenograft models. J Med Chem 56:1878-93 (2013)  
Target
Name:
Potassium voltage-gated channel subfamily H member 2
Synonyms:
1,3-beta-glucan synthase component GLS2 ERG Eag-related protein 1 Ether-a-go-go-related gene (HERG) Ether-a-go-go-related gene potassium channel 1 Ether-a-go-go-related gene potassium channel 1 (hERG1) Ether-a-go-go-related protein 1 H-ERG KCNH2 Potassium voltage-gated channel subfamily H member 2 (hERG) Voltage-gated potassium channel subunit Kv11.1 hERG Potassium Channel 1 | putative potassium channel subunit
Type:
Multi-pass membrane protein
Mol. Mass.:
126672.65
Organism:
Homo sapiens (Human)
Description:
Q12809
Residue:
1159
  
Inhibitor
Name:
BDBM50427282
Synonyms:
CHEMBL2325418
Type:
Small organic molecule
Emp. Form.:
C25H27NO2
Mol. Mass.:
373.4874
SMILES:
Cc1ccc(cc1C)C(CCC(N)C(O)=O)(c1ccccc1)c1ccccc1
: