Target
Sodium- and chloride-dependent GABA transporter 1
Ligand
BDBM50020883
Substrate
Meas. Tech.
ChEMBL_941202 (CHEMBL2329713)
IC50
40700000±n/a nM
Citation
 Vogensen, SBJørgensen, LMadsen, KKBorkar, NWellendorph, PSkovgaard-Petersen, JSchousboe, AWhite, HSKrogsgaard-Larsen, PClausen, RP Selective mGAT2 (BGT-1) GABA uptake inhibitors: design, synthesis, and pharmacological characterization. J Med Chem 56:2160-4 (2013)  
Target
Name:
Sodium- and chloride-dependent GABA transporter 1
Synonyms:
GABA transporter Gabt1 Gat1 Slc6a1
Type:
PROTEIN
Mol. Mass.:
67006.26
Organism:
Mus musculus
Description:
ChEMBL_788602
Residue:
599
  
Inhibitor
Name:
BDBM50020883
Synonyms:
(R)-Piperidine-3-carboxylic acid CHEMBL77575 | Nipecotic acid
Type:
Small organic molecule
Emp. Form.:
C6H11NO2
Mol. Mass.:
129.157
SMILES:
OC(=O)[C@@H]1CCCNC1
: