Target
Nuclear factor NF-kappa-B p105 subunit
Ligand
BDBM50427547
Substrate
Meas. Tech.
ChEMBL_941587 (CHEMBL2330627)
EC50
40000±n/a nM
Citation
 Marzaro, GGuiotto, ABorgatti, MFinotti, AGambari, RBreveglieri, GChilin, A Psoralen derivatives as inhibitors of NF-¿B/DNA interaction: synthesis, molecular modeling, 3D-QSAR, and biological evaluation. J Med Chem 56:1830-42 (2013)  
Target
Name:
Nuclear factor NF-kappa-B p105 subunit
Synonyms:
NFKB1 Nuclear factor NF-kappa-B (NF-kB) Nuclear factor NF-kappa-B p105 subunit
Type:
Protein
Mol. Mass.:
105329.57
Organism:
Homo sapiens (Human)
Description:
P19838
Residue:
968
  
Inhibitor
Name:
BDBM50427547
Synonyms:
CHEMBL2322270
Type:
Small organic molecule
Emp. Form.:
C23H19NO6
Mol. Mass.:
405.4001
SMILES:
Cc1oc2cc3oc(=O)c(CC(=O)Nc4ccc(cc4)C(O)=O)c(C)c3cc2c1C
: