Target
Gamma-aminobutyric acid type B receptor subunit 1/2
Ligand
BDBM50427612
Substrate
Meas. Tech.
ChEMBL_941739 (CHEMBL2331015)
EC50
53500±n/a nM
Citation
 Han, CSalyer, AEKim, EHJiang, XJarrard, REPowers, MSKirchhoff, AMSalvador, TKChester, JAHockerman, GHColby, DA Evaluation of difluoromethyl ketones as agonists of the¿-aminobutyric acid type B (GABAB) receptor. J Med Chem 56:2456-65 (2013)  
Target
Name:
Gamma-aminobutyric acid type B receptor subunit 1/2
Synonyms:
GABA-B receptor | GABA-B receptor 1/2
Type:
Mol. Mass.:
Description:
ASSAY_ID of EBI is 68423
Components:
This complex has 2 components.
Component 1
Name:
Gamma-aminobutyric acid type B receptor subunit 1
Synonyms:
GABA-B receptor GABA-B-R1 GABBR1 GARABR1 Gb1
Type:
Enzyme Catalytic Domain
Mol. Mass.:
108337.22
Organism:
Homo sapiens (Human)
Description:
Q9UBS5
Residue:
961
  
Component 2
Name:
Gamma-aminobutyric acid type B receptor subunit 2
Synonyms:
GABA-B receptor GABR2_HUMAN GPRC3B
Type:
PROTEIN
Mol. Mass.:
105844.45
Organism:
Homo sapiens (Human)
Description:
EBI_100031
Residue:
941
  
Inhibitor
Name:
BDBM50427612
Synonyms:
CHEMBL2322942
Type:
Small organic molecule
Emp. Form.:
C19H20F2O2
Mol. Mass.:
318.3577
SMILES:
OC(C1CCCCC1)C(F)(F)C(=O)c1ccc2ccccc2c1
: