Target
Aldo-keto reductase family 1 member C1
Ligand
BDBM50427619
Substrate
Meas. Tech.
ChEMBL_941821 (CHEMBL2329812)
IC50
100000±n/a nM
Citation
 Liedtke, AJAdeniji, AOChen, MByrns, MCJin, YChristianson, DWMarnett, LJPenning, TM Development of potent and selective indomethacin analogues for the inhibition of AKR1C3 (Type 5 17ß-hydroxysteroid dehydrogenase/prostaglandin F synthase) in castrate-resistant prostate cancer. J Med Chem 56:2429-46 (2013)  
Target
Name:
Aldo-keto reductase family 1 member C1
Synonyms:
20-alpha-HSD AK1C1_HUMAN Aldo-keto reductase family 1 member C1 (AK1C1) Aldo-keto reductase family 1 member C1 (AKR1C1) DDH High-affinity hepatic bile acid-binding protein | Trans-1,2-dihydrobenzene-1,2-diol dehydrogenase
Type:
Enzyme
Mol. Mass.:
36793.97
Organism:
Homo sapiens (Human)
Description:
Recombinant AKR1C1 enzyme was expressed in E. coli.
Residue:
323
  
Inhibitor
Name:
BDBM50427619
Synonyms:
CHEMBL2323511 | US9346803, 3
Type:
Small organic molecule
Emp. Form.:
C21H21ClN2O5S
Mol. Mass.:
448.92
SMILES:
COc1ccc2n(C(=O)c3ccc(Cl)cc3)c(CCC(=O)NS(C)(=O)=O)c(C)c2c1
: