Target
Tyrosine-protein kinase ABL2
Ligand
BDBM50427740
Substrate
Meas. Tech.
ChEMBL_941937 (CHEMBL2330094)
IC50
163±n/a nM
Citation
 Desai, BDixon, KFarrant, EFeng, QGibson, KRvan Hoorn, WPMills, JMorgan, TParry, DMRamjee, MKSelway, CNTarver, GJWhitlock, GWright, AG Rapid discovery of a novel series of Abl kinase inhibitors by application of an integrated microfluidic synthesis and screening platform. J Med Chem 56:3033-47 (2013)  
Target
Name:
Tyrosine-protein kinase ABL2
Synonyms:
ABL2 ABLL Abelson murine leukemia viral oncogene homolog 2 Tyrosine kinase ARG | VHL/Tyrosine-protein kinase ABL2
Type:
PROTEIN
Mol. Mass.:
128360.63
Organism:
Homo sapiens (Human)
Description:
ChEMBL_325082
Residue:
1182
  
Inhibitor
Name:
BDBM50427740
Synonyms:
CHEMBL2324932
Type:
Small organic molecule
Emp. Form.:
C25H18F3N5O
Mol. Mass.:
461.4385
SMILES:
Cc1ccc(NC(=O)c2ccc(Cn3ccnc3)c(c2)C(F)(F)F)cc1C#Cc1cncnc1
: