Target
Hypoxanthine-guanine phosphoribosyltransferase
Ligand
BDBM50427810
Substrate
Meas. Tech.
ChEMBL_940694 (CHEMBL2329985)
Ki
30±n/a nM
Citation
 Keough, DTŠpacek, PHocková, DTichý, TVrbková, SSlavetínská, LJaneba, ZNaesens, LEdstein, MDChavchich, MWang, THde Jersey, JGuddat, LW Acyclic nucleoside phosphonates containing a second phosphonate group are potent inhibitors of 6-oxopurine phosphoribosyltransferases and have antimalarial activity. J Med Chem 56:2513-26 (2013)  
Target
Name:
Hypoxanthine-guanine phosphoribosyltransferase
Synonyms:
HGPRT HPRT HPRT_HUMAN Hypoxanthine-guanine phosphoribosyltransferase (HGPRT)
Type:
Protein
Mol. Mass.:
24579.61
Organism:
Homo sapiens (Human)
Description:
P00492
Residue:
218
  
Inhibitor
Name:
BDBM50427810
Synonyms:
CHEMBL2325752
Type:
Small organic molecule
Emp. Form.:
C11H19N5O9P2
Mol. Mass.:
427.2442
SMILES:
Nc1nc2n(CC(COCP(O)(O)=O)COCP(O)(O)=O)cnc2c(=O)[nH]1
: