Target
Bcl-2-like protein 1
Ligand
BDBM50427828
Substrate
Meas. Tech.
ChEMBL_940708 (CHEMBL2329999)
IC50
13±n/a nM
Citation
 Aguilar, AZhou, HChen, JLiu, LBai, LMcEachern, DYang, CYMeagher, JStuckey, JWang, S A potent and highly efficacious Bcl-2/Bcl-xL inhibitor. J Med Chem 56:3048-67 (2013)  
Target
Name:
Bcl-2-like protein 1
Synonyms:
Anti-apoptotic Bcl-2 protein Apoptosis regulator Bcl-X BCL2-like 1 isoform 1 BCL2L1 Bcl-2-like protein 1 (Bcl-XL) Bcl-xL/Bcl-2-binding component 3 Bcl2-antagonist of cell death (BAD)
Type:
Mitochondrion membrane; Single-pass membrane protein
Mol. Mass.:
26039.60
Organism:
Homo sapiens (Human)
Description:
Residue:
233
  
Inhibitor
Name:
BDBM50427828
Synonyms:
CHEMBL2325768
Type:
Small organic molecule
Emp. Form.:
C47H49ClF3N7O4S2
Mol. Mass.:
932.515
SMILES:
CN(C)CC[C@H](CSc1ccccc1)Nc1ccc(cc1[N+]([O-])=O)S(=O)(=O)Nc1ccc(cc1)N1CCN(CC1)c1cccc(c1)-c1c(-c2ccc(Cl)cc2)n(C)c(C)c1C(F)(F)F
: