Target
Apoptosis regulator Bcl-2
Ligand
BDBM50427820
Substrate
Meas. Tech.
ChEMBL_940709 (CHEMBL2330000)
IC50
350±n/a nM
Citation
 Aguilar, AZhou, HChen, JLiu, LBai, LMcEachern, DYang, CYMeagher, JStuckey, JWang, S A potent and highly efficacious Bcl-2/Bcl-xL inhibitor. J Med Chem 56:3048-67 (2013)  
Target
Name:
Apoptosis regulator Bcl-2
Synonyms:
Apoptosis regulator Bcl-2 Protein BCL-2 BCL2_HUMAN | Bcl-2 Protein
Type:
Homodimer or heterodimer
Mol. Mass.:
26269.11
Organism:
Homo sapiens (Human)
Description:
P10415
Residue:
239
  
Inhibitor
Name:
BDBM50427820
Synonyms:
CHEMBL2326038
Type:
Small organic molecule
Emp. Form.:
C43H44ClN7O5S2
Mol. Mass.:
838.436
SMILES:
CN(C)CCC(CSc1ccccc1)Nc1ccc(cc1[N+]([O-])=O)S(=O)(=O)Nc1ccc(cc1)N1CCN(CC1)c1cccc(c1)-c1c[n-][o+]c1-c1ccc(Cl)cc1
: